SensorWeb Properties Ontology
type: Ontology
imports: quantitykind
imports: systems
creator: OpenSensorHub Community
version info: 1.0

AssignedProperty
type: Class
subclass of: Property
definition: A property that is assigned to an entity, not measured.

Data Property
type: Class
subclass of: Property
definition: Field used in data records or messages that does not represent a measurable property (e.g. message identifiers, sequence numbers, etc.).

ResponseCurve
type: Class
subclass of: SystemProperty
definition: Curve used to characterize a transducer's response over a certain physical domain or with respect to another varying quantity (e.g. time domain, frequency domain, spatial domain, environmental parameters, etc.)

AbsoluteAccuracy
type: NamedIndividual
type: Concept
type: Accuracy
definition: Absolute accuracy decribes how close a measured value is to a known absolute true value, usually provided in the same unit as the measured value itself. Note: Accuracy is closeness of the measurements to a specific value, while precision is the closeness of the measurements to each other.

AlphaChannel
type: NamedIndividual
type: Data Property
type: Concept
definition: The alpha channel of an RGBA or BGRA image.

AzimuthAngle
type: NamedIndividual
type: Concept
type: ObservableProperty
broad match: PlaneAngle
definition: Azimuth is one of the angular measurements in a spherical coordinate system. In such coordinate system, the (radial) vector from an observer (origin) to a point of interest is projected perpendicularly onto a reference plane. The azimuth is the angle between the projected vector and a reference vector on the reference plane. When used in conjunction with an ENU or NED reference frame, the reference plane is the local horizontal plane and thus the azimuth angle is the horizontal angle from/to magnetic or true north.

BarometricAltitude
type: NamedIndividual
type: Concept
type: ObservableProperty
broader: Height
definition: Barometric altitude is the altitude determined by a pressure measurement which is converted to altitude through interpolation of the International Standard Atmosphere (ICAO, 1976). A mean sea level pressure of 1013.25 hPa is used for the surface pressure.

BatteryCapacity
type: NamedIndividual
type: Concept
type: OperatingProperty
broad match: Energy
definition: A battery's capacity is the amount of electric charge it can deliver at the rated voltage. Capacity is measured in units such as amp-hour (A·h).

BatteryLevel
type: NamedIndividual
type: Concept
type: ObservableProperty
definition: Remaining battery charge. Often expressed in % of the total battery capacity.

BlueChannel
type: NamedIndividual
type: Data Property
type: Concept
definition: The blue channel of an RGB or BGR image. if not specified otherwise, this channel usually contains data representing an amount of blue visible light. When the blue channel is used for another purpose, the actual measured quantity should be documented separately.
related: Blue Band

ISO Sensitivity
type: NamedIndividual
type: Concept
type: Sensitivity
definition: ISO Sensitivity (or ISO speed) is a numerical system for quantifying the sensitivity of a photographic emulsion, or a solid-state digital-camera's image sensor, to visible light (e.g. ISO 100).

CharacteristicCurve
type: NamedIndividual
type: ResponseCurve
type: Concept
definition: The characteristic curve (sometimes called calibration curve) indicates the dependence of the output signal (measured value) upon the input signal (observed property) in steady-state condition. It is a simplified way of describing the transfer function of a transducer (e.g. sensor, actuator) or other system.

Coordinate
type: NamedIndividual
type: Concept
type: ObservableProperty
definition: Coordinates are numerical quantities used to uniquely determine the position of a point or other geometric element on a manifold such as Euclidean space. They are used in conjuction with a coordinate system.

Count
type: NamedIndividual
type: Concept
type: ObservableProperty
definition: A generic count value, that is the result of counting an integer number of elements.

CovarianceMatrix
type: NamedIndividual
type: Concept
type: ObservableProperty
definition: A symmetric N×N matrix, formed by the pairwise covariances of several random variables. Sometimes called a dispersion matrix.

Digital Number
type: NamedIndividual
type: Data Property
type: Concept
alternative label: DN
definition: A digital number is the discrete digital representation of an analog value sampled by an analog-to-digital converter.

DirectionalResponse
type: NamedIndividual
type: ResponseCurve
type: Concept
definition: The directional response (also called directionality or polar pattern) indicates how sensitive a transducer is to signals arriving at different angles from its central axis. It can be defined in 2 or 3 dimensions.

Duration
type: NamedIndividual
type: Concept
type: ObservableProperty
broad match: Time
definition: The amount of elapsed time between two events.

DynamicRange
type: NamedIndividual
type: Concept
type: SystemProperty
definition: The dynamic range is the ratio between the largest and smallest values that a certain quantity can assume (often measured in dB). It is often used in the context of signals, like sound and light.

ElevationAngle
type: NamedIndividual
type: Concept
type: ObservableProperty
broad match: PlaneAngle
definition: Elevation is one of the angular measurements in a spherical coordinate system. It is the angle between the radial vector and the reference plane. When used in conjunction with an ENU or NED reference frame, the reference plane is the local horizontal plane and the elevation angle is the vertical angle.

EulerAngles
type: NamedIndividual
type: Concept
type: ObservableProperty
broader: Orientation
definition: Euler angles are three angles used to describe the orientation of a rigid body with respect to a fixed coordinate system. A special kind of Euler angles called Tait–Bryan angles are often used to describe the orientation of vehicles or other objects with the heading/pitch/roll or pitch/roll/yaw convention.

FieldOfView
type: NamedIndividual
type: Concept
type: SystemProperty
definition: Field of view (FOV) describes the angular extent through which an electro-optical sensor is sensitive to electromagnetic radiation (e.g. the solid angle imaged by a camera). It can be measured vertically, horizontally, or diagonally. For the common case of rectangular image sensors, the extent has a pyramidal shape. When the image sensor is not square, horizontal and vertical field of views are different but can be mutually derived using the aspect ratio of the image. For optical instruments, the FOV can be computed from the focal length of the optics if the metric size of the image sensor is also known.

FirmwareVersion
type: NamedIndividual
type: Identifier
type: Concept
broader: SoftwareVersion
definition: Unique name or number assigned to identify a given state of development of a device firmware.

FocalLength
type: NamedIndividual
type: Concept
type: SystemProperty
definition: The focal length of an optical system is a measure of how strongly the system converges or diverges light. For a perfect lens (pinhole model), the focal length is the distance from the center of the lens to its principal foci (or focal point).

GeocentricLatitude
type: NamedIndividual
type: Concept
type: ObservableProperty
comment: The geocentric latitude is a latitude coordinate measured as the angle between the radial direction (from centre to the point on the surface) and the equatorial plane.
broader: Latitude

GeodeticLatitude
type: NamedIndividual
type: Concept
type: ObservableProperty
broader: Latitude
definition: The geodetic latitude is measured as the angle between the normal to the ellipsoid at the location in question and the equatorial plane.

GrayChannel
type: NamedIndividual
type: Data Property
type: Concept
definition: The single channel of a grayscale image. Note that this is a very generic channel definition. It is highly recommended to use a more specific definition describing the actual measured quantity whenever possible.

GreenChannel
type: NamedIndividual
type: Data Property
type: Concept
definition: The green channel of an RGB or BGR image. if not specified otherwise, this channel usually contains data representing an amount of green visible light. When the green channel is used for another purpose, the actual measured quantity should be documented separately.
related: Green Band

GridHeight
type: NamedIndividual
type: Data Property
type: Concept
definition: Height of a raster image or coverage grid as an integer number of cells or pixels.

GridWidth
type: NamedIndividual
type: Data Property
type: Concept
definition: Width of a raster image or coverage grid as an integer number of cells or pixels.

GroundSpeed
type: NamedIndividual
type: Concept
type: ObservableProperty
broad match: Speed
definition: Ground speed (or Speed over Ground, or SOG) is the speed of a vehicle relative to the ground, that is to say relative to an Earth fixed coordinate frame such as ECEF. A GPS receiver reports ground speed.

Height
type: NamedIndividual
type: Concept
type: ObservableProperty
definition: Height (or elevation, or altitude) is a measure of a vertical distance with respect to a certain vertical datum (e.g the surface of the earth).

HeightAboveAverageTerrain
type: NamedIndividual
type: Concept
type: ObservableProperty
broader: Height
definition: Height above average terrain (HAAT) is a height measured with respect to the surrounding landscape (the resolution of the terrain used for the calculation is usually around 1km). It is often used in broadcast engineering as it is a better criteria than height-above-ground (AGL) for determining the range of brodcasts emitted by an antenna.

HeightAboveEllipsoid
type: NamedIndividual
type: Concept
type: ObservableProperty
broader: Height
definition: Height (or elevation, or altitude) above the ellipsoid (also called ellipsoidal height) is the measure of a vertical distance above a mathematical model that approximates the shape of the earth with a reference ellipsoid. The most common one is the WGS84 ellipsoid used by the GPS system.

HeightAboveGround
type: NamedIndividual
type: Concept
type: ObservableProperty
broader: Height
definition: Height above ground level (AGL) is a height measured with respect to the underlying ground surface. Its use is common in aviation, atmospheric sciences and broadcasting.

HeightAboveMSL
type: NamedIndividual
type: Concept
type: ObservableProperty
broader: Height
definition: Height (or elevation, or altitude) above mean sea level (also called orthometric height) is the measure of a vertical distance above an imaginary surface called the geoid, which is determined by the earth's gravity and approximated by the mean sea level (MSL). Spherical harmonics are often used to approximate the shape of the geoid. The current best such set of spherical harmonic coefficients is EGM96 (Earth Gravity Model 1996).

Histogram
type: NamedIndividual
type: DataStructure
type: Concept
definition: A histogram is an approximate representation of the distribution of numerical or categorical data. To construct a histogram, one divides the entire range of possible values of a variable into a series of intervals (called bins) and then counts how many values fall into each interval. The bins are usually specified as consecutive, non-overlapping intervals, and often (but not required to be) of equal size. A histogram may also be normalized to display "relative" frequencies. It then shows the proportion of cases that fall into each of several categories, with the sum of the heights equaling 1. Bins may also be sorted by frequency.

ImpulseResponse
type: NamedIndividual
type: ResponseCurve
type: Concept
definition: The impulse response, or impulse response function (IRF), of a dynamic system is its output when presented with a brief input signal, called an impulse.

IntegrationTime
type: NamedIndividual
type: Concept
type: SystemProperty
broader: Duration
definition: The length of time during which a noisy signal is averaged in order to improve the signal to noise ratio in an electronic system. More specifically, for digital sensors, it is the length of time during which the signal generated by sensing elements is oversampled and averaged by the sensor's internal electronics before generating the final output value. For electro-optical sensors, it is also called Exposure Time.

Irradiance
type: NamedIndividual
type: Concept
type: ObservableProperty
definition: Irradiance, radiant emittance, and radiant exitance are measures of the radiant flux (power) per unit area of electromagnetic radiation at a surface. "Irradiance" is used when the electromagnetic radiation is incident on the surface. "Radiant exitance" or "radiant emittance" is used when the radiation is emerging from the surface. The SI units for all of these quantities are watts per square meter (W/m2). All of these quantities characterize the total amount of radiation present, at all frequencies.
related: SpectralIrradiance

Latitude
type: NamedIndividual
type: Concept
type: ObservableProperty
broad match: PlaneAngle
definition: Latitude is a geographic coordinate that specifies the north–south position of a point on the Earth's surface, or the surface of a celestial body. Latitude is an angle which ranges from 0° at the Equator to ±90° at the poles.

The aperture of an optical system expressed as a ratio between the lens focal length and the effective aperture diameter (also called f-number of f-ratio).
type: NamedIndividual
type: Concept
type: SystemProperty

LinearDynamicRange
type: NamedIndividual
type: Concept
type: SystemProperty
definition: The linear dynamic range of a transducer is a measure of the difference between the highest and lowest input signal to which the transducer responds linearly. It is often expressed as a range of minimum/maximum measurable values or simply as the ratio between these two values (often measured in dB).

Location
type: NamedIndividual
type: Concept
type: ObservableProperty
definition: Location of a point in space (not necessarily Euclidean space) with respect to a frame of reference. Location is often called 'position' in physics but in the context of the SensorWeb we reserve the term Position for the full pose of a rigid body in space, including both Location and Orientation.

LocationVector
type: NamedIndividual
type: Concept
type: ObservableProperty
broader: Location
definition: A location vector is a coordinate tuple representing the location of a point P in space with respect to a well defined coordinate reference system. Most commonly used coordinate reference systems are Cartesian reference frames (Euclidean space) and geographic coordinate systems.

LongName
type: NamedIndividual
type: Identifier
type: Concept
definition: The full human-readable name of the system or object.

Longitude
type: NamedIndividual
type: Concept
type: ObservableProperty
broad match: PlaneAngle
definition: Longitude is a geographic coordinate that specifies the east–west position of a point on the Earth's surface, or the surface of a celestial body. It is defined as the angle between the plane that passes through the Prime Meridian and a plane through both poles and the location in question. Its value ranges from 0° at the Prime Meridian to +180° eastward and -180° westward.

MagneticBearing
type: NamedIndividual
type: Concept
type: ObservableProperty
broad match: PlaneAngle
exact match: Magnetic bearing is the horizontal angle between the direction towards an object from the point of view of an observer and the direction of magnetic north.

MagneticHeading
type: NamedIndividual
type: Concept
type: ObservableProperty
broad match: Heading (navigation)
broad match: PlaneAngle
definition: Angle formed between an object's or vehicle's heading direction and the magnetic north. The difference between true and magnetic heading angles is called magnetic variation and is due to the magnetic north pole and geographic north pole being hundreds of miles apart, as well as other local variations of the earth magnetic field.

Manufacturer
type: NamedIndividual
type: Classifier
type: Concept
definition: The organization responsible for building the system.

Material
type: NamedIndividual
type: Concept
type: SystemProperty
definition: The main material an object is made of.

ModelNumber
type: NamedIndividual
type: Identifier
type: Concept
definition: An alpha-numeric designation identifying a particular model and version of equipment.

NetworkID
type: NamedIndividual
type: Classifier
type: Concept
comment: The identifier of the Sensor Network that this sensor is a part of.

Offset
type: NamedIndividual
type: Concept
type: ObservableProperty
definition: Offset (or bias) is the continuous output signal output by a transducer when no input signal (i.e. no external stimulus for a detector) is applied to it. It is often provided in calibration tables along with the gain or sensitivity of a transducer.

Operator
type: NamedIndividual
type: Classifier
type: Concept
definition: The individual or organization responsible for operating the system.

Orientation
type: NamedIndividual
type: Concept
type: ObservableProperty
definition: Orientation (or attitude) describes the angular position of a rigid body with respect to a frame of reference. The frame of reference and the frame attached to the body should both be formally defined.
related: Angle

PanAngle
type: NamedIndividual
type: Concept
type: ObservableProperty
broad match: PlaneAngle
definition: The pan angle quantifies the amount of rotation of a video or still camera about a reference vertical axis (often the local vertical axis when the PTZ camera is mounted level). It is the angle between the direction that the optical axis of the camera is pointing at and a reference direction (provided by the reference frame). In the resulting image, a panning motion makes the view seemingly translate along the image horizontal axis.

PitchAngle
type: NamedIndividual
type: Concept
type: ObservableProperty
broad match: PlaneAngle
definition: The pitch angle is one of the Tait-Bryan angles (Euler angles). It quantifies the rotation around the lateral axis, causing the nose of the object to point up or down from the local horizontal plane.

PlatformType
type: NamedIndividual
type: Classifier
type: Concept
definition: Type of platform, usually further qualified by an application specific code space.

Position
type: NamedIndividual
type: Concept
type: ObservableProperty
definition: Position refers to the complete pose of a rigid body (object) in space, including both Location and Orientation.
related: Location
related: Orientation

PowerSpectralDensity
type: NamedIndividual
type: Concept
type: ObservableProperty
broader: PowerSpectrum
broader: SpectralDensity
definition: Power Spectral Density is a normalized measure of a signal's power content versus frequency or wavelength. It is a special case of Spectral Density and thus each spectral value is normalized and expressed per unit frequency or wavelength.

PowerSpectrum
type: NamedIndividual
type: Concept
type: ObservableProperty
definition: The Power Spectrum is a measure of a signal's power content versus frequency or wavelength. The most common way of generating a power spectrum is by using a discrete Fourier transform, but other techniques such as the maximum entropy method can also be used. On the contrary to Power Spectral Density, a Power Spectrum is not normalized and thus expressed directly in units of power or power level (dB).
related: PowerSpectralDensity

QuantizationError
type: NamedIndividual
type: Concept
type: SystemProperty
definition: The quantization error is the difference between an input value (often an analog signal) and its quantized value (often a digital signal). This is an important characteristic of any analog to digital converter (ADC) as quantization is an integral part of the conversion process.

RasterImage
type: NamedIndividual
type: DataStructure
type: Concept
definition: A raster image (or raster graphics) is a dot matrix data structure that represents a generally rectangular grid of pixels (points of color), viewable via a monitor, or other display medium. Raster images are stored in image files with varying formats.

RedChannel
type: NamedIndividual
type: Data Property
type: Concept
definition: The red channel of an RGB or BGR image. if not specified otherwise, this channel usually contains data representing an amount of red visible light. When the red channel is used for another purpose, the actual measured quantity should be documented separately.
related: Red Band

RelativeAccuracy
type: NamedIndividual
type: Concept
type: Accuracy
definition: Relative accuracy (or relative error) is a description of how close a measured value is to the known true value on relative terms, that is relative to the size of the measured value itself. Note: Accuracy is closeness of the measurements to a specific value, while precision is the closeness of the measurements to each other.

RelativeBearing
type: NamedIndividual
type: Concept
type: ObservableProperty
broad match: PlaneAngle
definition: Relative bearing is the horizontal angle between the direction towards an object from the point of view of an observer and the observer's own heading/forward direction.

ReportingFrequency
type: NamedIndividual
type: Concept
type: Frequency
broad match: Frequency
definition: The frequency at which a digital sensor or process outputs values. For sensors, this is different from the sampling frequency when oversampling is used.

RollAngle
type: NamedIndividual
type: Concept
type: ObservableProperty
broad match: PlaneAngle
definition: The roll angle is one of the Tait-Bryan angles (Euler angles). It quantifies the rotation around the longitudinal axis, making the object tilt right or left.

RotationAxisAngle
type: NamedIndividual
type: Concept
type: ObservableProperty
broader: Orientation
definition: The axis–angle representation of a rotation parameterizes a rotation in a three-dimensional Euclidean space by two quantities: a unit vector e indicating the direction of an axis of rotation, and an angle θ describing the magnitude of the rotation about the axis. Both the rotation axis and the angle are represented by a single vector codirectional with the rotation axis whose length is the rotation angle θ.

RotationMatrix
type: NamedIndividual
type: Concept
type: ObservableProperty
broader: Orientation
definition: A rotation matrix is a matrix that is used to describe a rotation in Euclidean space.

RotationQuaternion
type: NamedIndividual
type: Concept
type: ObservableProperty
broader: Orientation
definition: Quaternion used to describe the orientation of a rigid body with respect to a frame of reference.

Signal-to-Noise Ratio
type: NamedIndividual
type: Concept
type: ObservableProperty
type: SystemProperty
alternative label: SNR
definition: Signal-to-noise ratio (abbreviated SNR) is a measure used in science and engineering that compares the level of a desired signal to the level of background noise. SNR is defined as the ratio of signal power to the noise power, often expressed in decibels.

SamplingFrequency
type: NamedIndividual
type: Concept
type: Frequency
broad match: Frequency
definition: The sampling frequency (or sampling rate) defines the number of samples per second (or per other temporal unit) taken from a continuous signal to make a discrete or digital signal. The Nyquist–Shannon sampling theorem (Nyquist principle) states that perfect reconstruction of a signal is possible when the sampling frequency is greater than twice the maximum frequency of the signal being sampled.

SensorType
type: NamedIndividual
type: Classifier
type: Concept
definition: Type of sensor, usually further qualified by an application specific code space.

SequenceNumber
type: NamedIndividual
type: Concept
type: ObservableProperty
definition: Integer number used to uniquely identify an object (often a digital object) in a sequence. A sequence number is usually monotonically increasing but can sometime wrap around when reaching its maximum value (i.e. the maximum value allowed by the data type or representation).

SerialNumber
type: NamedIndividual
type: Identifier
type: Concept
definition: An unique alpha-numeric designation identifying a particular piece of equipment.

ShortName
type: NamedIndividual
type: Identifier
type: Concept
definition: The short human-readable name of the system or object (usually less than 30 characters).

SoftwareVersion
type: NamedIndividual
type: Identifier
type: Concept
definition: Unique name or number assigned to identify a given state of development of a piece of computer software.

SortedHistogram
type: NamedIndividual
type: DataStructure
type: Concept
broader: Histogram
definition: A histogram where the bins are ordered from highest to lowest frequency.

SpectralDensity
type: NamedIndividual
type: Concept
type: ObservableProperty
definition: The Spectral Density of a signal is a way of describing its content in terms of its frequency (or wavelength) components. The term 'density' is used because the spectral values are normalized and expressed per unit frequency or wavelength. This normalization allows two spectral densities to be comparable even if the frequency resolutions used for the calculation differ. The most commonly used form of Spectral Density is the Power Spectral Density (PSD).

SpectralIrradiance
type: NamedIndividual
type: Concept
type: ObservableProperty
definition: Spectral irradiance is the irradiance of a surface per unit frequency or wavelength, depending on whether the spectrum is taken as a function of frequency or of wavelength. The two forms have different dimensions: Spectral irradiance of a frequency spectrum is measured in watts per square metre per hertz (W⋅m−2⋅Hz−1), while spectral irradiance of a wavelength spectrum is measured in watts per square metre per metre (W⋅m−3), or more commonly watts per square metre per nanometre (W⋅m−2⋅nm−1).
related: Irradiance

SpectralRadiance
type: NamedIndividual
type: Concept
type: ObservableProperty
definition: Radiance of a surface per unit frequency or wavelength. The latter is commonly measured in W⋅sr−1⋅m−2⋅nm−1. This is a directional quantity.
related: Radiance

SpectralResponse
type: NamedIndividual
type: ResponseCurve
type: Concept
definition: The spectral response or frequency response of a transducer provides its output level or sensitivity over its operating range in the frequency domain. A spectral response can be expressed in terms of the input signal's frequency, period or wavelength.

SpeedOverWater
type: NamedIndividual
type: Concept
type: ObservableProperty
broad match: Speed
definition: Speed over Water (or Speed through Water (STW)) is the speed of a watercraft relative to the water mass it is traveling on.

SubsystemID
type: NamedIndividual
type: Identifier
type: Concept
definition: Short alpha-numerical ID used to identify a Component or Subsystem within the scope of its parent System (e.g. Sensor System, Sensor Array, Sensor Network, etc.). The uniqueness of such ID is only guaranteed within the scope of the parent System, and thus may be different from the globally unique ID of the subsystem.

SystemStatus
type: NamedIndividual
type: Concept
type: SystemProperty
definition: Status of a system. This is often a status code taken from a list of predefined options, sometimes defined in a separate code space.

SystemType
type: NamedIndividual
type: Classifier
type: Concept
definition: Type of system, usually further qualified by an application specific code space.

SystemUID
type: NamedIndividual
type: Identifier
type: Concept
definition: Globally unique ID of a System, generally in the form of a URI or plain UUID.

TargetLocation
type: NamedIndividual
type: Concept
definition: Location of a target entity in space (see TargetType).

TargetType
type: NamedIndividual
type: Classifier
type: Concept
definition: Type of target entity, usually further qualified by an application specific codespace. For a sensor, a target is an entity that is being searched, detected or tracked. It can then become the feature of interest of additional observations. For an actuator, a target is an entity that is being designated or physically interacted with.

TiltAngle
type: NamedIndividual
type: Concept
type: ObservableProperty
broad match: PlaneAngle
definition: The tilt angle quantifies the amount or rotation of a video or still camera about the camera horizontal axis, corresponding to an up/down camera motion. It is the angle between the direction that the camera optical axis is pointing at and a reference plane that is orthogonal to the camera reference vertical axis (this reference plane is usually the local horizontal place when the PTZ camera is mounted level). In the resulting image, a tilting motion makes the view seemingly translate along the image vertical axis.

TimeSeries
type: NamedIndividual
type: DataStructure
type: Concept
definition: A time series is a series of data points listed in time order. Thus it is a sequence of discrete time-stamped events or data.

Trajectory
type: NamedIndividual
type: DataStructure
type: Concept
broader: TimeSeries
definition: A trajectory is the path that an object follows through space as a function of time. When measured by a position sensor such as GPS, it is usually represented as a time series of location/position coordinate tuples.

TransmitterID
type: NamedIndividual
type: Identifier
type: Concept
definition: The unique identifier of the transmitter used to exchange data with a System. It can be further qualified with a codespace such as the International Mobile Equipment Identity (IMEI).

TrueAirSpeed
type: NamedIndividual
type: Concept
type: ObservableProperty
broad match: Speed
definition: Speed of an aircraft relative to the airmass in which it is flying.

TrueBearing
type: NamedIndividual
type: Concept
type: ObservableProperty
broad match: PlaneAngle
definition: True bearing is the horizontal angle between the direction towards an object from the point of view of an observer and the direction of true north.

TrueHeading
type: NamedIndividual
type: Concept
type: ObservableProperty
broad match: Heading (navigation)
broad match: PlaneAngle
definition: Angle formed between an object's or vehicle's heading direction and the direction of true north (i.e. the geographic north pole).

VideoFrame
type: NamedIndividual
type: DataStructure
type: Concept
definition: A video frame contains data for a single frame of a video stream, including both the image data and a sequence number or timestamp. A video frame can contain data for a key frame or an inter-frame.

Width
type: NamedIndividual
type: Concept
type: ObservableProperty
broad match: Length
definition: Width is a measure of the size of an object, taken side to side at a right angle from the length.

YawAngle
type: NamedIndividual
type: Concept
type: ObservableProperty
broad match: PlaneAngle
definition: The yaw angle is one of the Tait-Bryan angles (Euler angles). It is the angle between an object's or vehicle's heading and a reference heading (often true or magnetic north), corresponding to a rotation about the local vertical axis.

ZoomFactor
type: NamedIndividual
type: Concept
type: ObservableProperty
broad match: DimensionlessRatio
definition: The zoom factor is a numerical quantity describing the amount of zoom applied by a camera relatively to the maximum zoom position.

ArraySize
type: NamedIndividual
type: Data Property
type: Concept
definition: Size of one of the dimensions of a mono or multidimensional array.

ForecastTime
type: NamedIndividual
type: Concept
type: ObservableProperty
broad match: PhenomenonTime
definition: Time of occurence of a phenomenon (such as the particular value of a physical property) as forecasted by a model or algorithm.

MissionStartTime
type: NamedIndividual
type: Concept
type: ObservableProperty
broad match: Time
definition: Time recorded at the begining of a mission such as a flight takeoff or launch of a spacecraft, usually used as a time reference for further events.

Number of Points
type: NamedIndividual
type: Data Property
type: Concept
broad match: ArraySize
definition: Number of points or vertices in a geometry (such as a trajectory).

Number of Rows
type: NamedIndividual
type: Data Property
type: Concept
broad match: ArraySize
definition: Number of rows in a 2D raster dataset (such as imagery).

Number of Samples
type: NamedIndividual
type: Data Property
type: Concept
broad match: ArraySize
definition: Number of samples along one of the dimensions of an N-D coverage dataset.

PhenomenonTime
type: NamedIndividual
type: Concept
type: ObservableProperty
broad match: Time
broad match: phenomenonTime
definition: Time at which an observation result applies to the property of the feature. This is often the time of interaction between a sampling procedure or observation procedure with a real-world feature.

PlatformLocation
type: NamedIndividual
type: Concept
type: ObservableProperty
broader: Location
definition: Location of a platform carrying an object of interest (such as a sensor) with respect to a frame of reference. The exact point whose location is given should be defined by an engineering datum attached to the platform.

PlatformOrientation
type: NamedIndividual
type: Concept
type: ObservableProperty
broader: Orientation
definition: Orientation of a platform carrying an object of interest (such as a sensor), with respect to a frame of reference. The coordinate frame whose orientation is provided should be formally defined by an engineering datum attached to the platform.

RunTime
type: NamedIndividual
type: Data Property
type: Concept
broad match: Time
broad match: resultTime
definition: Time recorded at the begining of the execution of a model or algorithm whose results are simulated property values.

SamplingLocation
type: NamedIndividual
type: Concept
type: ObservableProperty
type: Sample
broader: Location
definition: Point in space where interaction of a sampling procedure with a real-world feature takes place. This is the point of space where the value resulting from the observation of the feature property applies and is thus the location used in geospatial analysis of the result. In the case of in-situ sensors this point is also where the measurement of the feature property takes place.

SamplingTime
type: NamedIndividual
type: Concept
type: ObservableProperty
broad match: PhenomenonTime
definition: Time of interaction of a sampling procedure with a real-world feature. This is the point in time where the (observed) value of the feature property occurs and is thus the temporal parameter normally used in geospatial analysis of the result.

ScanStartTime
type: NamedIndividual
type: Concept
type: ObservableProperty
broad match: Time
definition: Time recorded at the beginning of the cycle of a scanning instrument (such as a whiskbroom or conical scanner).

SensorLocation
type: NamedIndividual
type: Concept
type: ObservableProperty
broader: Location
definition: Location of a sensor with respect to a frame of reference. The exact point whose location is given should be defined by an engineering datum attached to the sensor.

SensorOrientation
type: NamedIndividual
type: Concept
type: ObservableProperty
broader: Orientation
definition: Orientation of a sensor with respect to a frame of reference. The coordinate frame whose orientation is provided should be formally defined by an engineering datum attached to the sensor.